{"text_format":"1","workbook":"xlsx","n_sheets":5,"sheets":["Toelichting","Cockpit","MJOP (2020-2049)","Prognose kasstromen","Parameters"],"not_rendered":{"charts":0,"images":3,"macros":1,"external_links":0,"defined_names":4,"comments":0,"pivot_tables":0},"unopened":[],"bounds":{"document_bytes":16777216,"sheet_cells":100000,"rows_first":2000,"rows_last":500,"rows_between":2000,"halvings":0,"cell_chars":16384,"cell_head_chars":4096},"cells_cut":0,"cells_raw":0,"read":"whole","date_system":"1900"}

{"sheet":"Toelichting","index":0,"n_rows":49,"n_cols":8,"rows_kept":49,"cut":false,"hidden":false,"merged":[[11,1,13,14]]}
[]
[]
[]
[]
[]
[]
[]
[null,"Rekenmodel"]
[]
[null,"Project",null,"Voorbeeldmodel business case wooncoöperaties"]
{"$rows_left_out":40}
{"sheet":"Cockpit","index":1,"n_rows":85,"n_cols":31,"rows_kept":85,"cut":false,"hidden":false,"merged":[]}
[{"$f":"CONCATENATE(\"Business case t.b.v. financieringsaanvraag - \",B4,)","v":"Business case t.b.v. financieringsaanvraag - Wooncoöperatie X"},null,{"$f":"CONCATENATE(\"Uitgangspunten \",B6)","v":"Uitgangspunten 2020"}]
["Uitgangspunten"]
["Algemeen"]
["Wooncoöperatie","Wooncoöperatie X"]
[]
["Beginjaar prognose",2020]
["Eindjaar prognose",{"$f":"B6+29","v":2049}]
[]
["Portefeuille","Sociale huur","Middenhuur"]
["Aantal verhuurde woningen  ",0,0,null,{"$f":"IF(B10+B11>50,\"Let op, meer dan 50 sociale huurwoningen. Er dient verhuurderheffing te worden betaald\",\"\")","v":""}]
{"$rows_left_out":76}
{"sheet":"MJOP (2020-2049)","index":2,"n_rows":30,"n_cols":34,"rows_kept":30,"cut":false,"hidden":false,"merged":[]}
["Meerjaren Onderhoudsprognose (MJOP) - Nominale bedragen"]
[null,null,null,null,{"$f":"Cockpit!B6","v":2020},{"$f":"E2+1","v":2021},{"$f":"F2+1","v":2022},2023,2024,2025,2026,2027,2028,2029,2030,2031,2032,2033,2034,2035,2036,2037,2038,2039,2040,2041,2042,2043,2044,2045,2046,2047,2048,2049]
["Planmatig onderhoud",null,null,null,0,0,0,0,0,0,0,0,0,0,0,0,0,0,0,0,0,0,0,0,0,0,0,0,0,0,0,0,0,0]
["Mutatieonderhoud",null,null,null,0,0,0,0,0,0,0,0,0,0,0,0,0,0,0,0,0,0,0,0,0,0,0,0,0,0,0,0,0,0]
["Klachtenonderhoud",null,null,null,0,0,0,0,0,0,0,0,0,0,0,0,0,0,0,0,0,0,0,0,0,0,0,0,0,0,0,0,0,0]
["Onderhoud 4",null,null,null,0,0,0,0,0,0,0,0,0,0,0,0,0,0,0,0,0,0,0,0,0,0,0,0,0,0,0,0,0,0]
["Onderhoud 5",null,null,null,0,0,0,0,0,0,0,0,0,0,0,0,0,0,0,0,0,0,0,0,0,0,0,0,0,0,0,0,0,0]
["Onderhoud 6",null,null,null,0,0,0,0,0,0,0,0,0,0,0,0,0,0,0,0,0,0,0,0,0,0,0,0,0,0,0,0,0,0]
["Onderhoud 7",null,null,null,0,0,0,0,0,0,0,0,0,0,0,0,0,0,0,0,0,0,0,0,0,0,0,0,0,0,0,0,0,0]
["Onderhoud 8",null,null,null,0,0,0,0,0,0,0,0,0,0,0,0,0,0,0,0,0,0,0,0,0,0,0,0,0,0,0,0,0,0]
{"$rows_left_out":21}
{"sheet":"Prognose kasstromen","index":3,"n_rows":44,"n_cols":34,"rows_kept":44,"cut":false,"hidden":false,"merged":[]}
["Kasstroomoverzicht"]
[null,null,null,null,{"$f":"Cockpit!B6","v":2020},{"$f":"E2+1","v":2021},{"$f":"F2+1","v":2022},2023,2024,2025,2026,2027,2028,2029,2030,2031,2032,2033,2034,2035,2036,2037,2038,2039,2040,2041,{"$f":"Z2+1","v":2042},2043,2044,2045,2046,2047,{"$f":"AF2+1","v":2048},2049]
[]
["Opbrengsten"]
["Huuropbrengsten",null,null,null,{"$f":"(1-Cockpit!B23)*(((Cockpit!B10*Cockpit!B20*12)*(1+Parameters!C4))+((Cockpit!C10*Cockpit!C20*12*(1+Parameters!C4))))","v":0},{"$f":"E5*(1+Parameters!D4)","v":0},{"$f":"F5*(1+Parameters!E4)","v":0},{"$f":"G5*(1+Parameters!F4)","v":0},{"$f":"H5*(1+Parameters!G4)","v":0},{"$f":"I5*(1+Parameters!H4)","v":0},{"$f":"J5*(1+Parameters!I4)","v":0},{"$f":"K5*(1+Parameters!J4)","v":0},{"$f":"L5*(1+Parameters!K4)","v":0},{"$f":"M5*(1+Parameters!L4)","v":0},{"$f":"N5*(1+Parameters!M4)","v":0},{"$f":"O5*(1+Parameters!N4)","v":0},{"$f":"P5*(1+Parameters!O4)","v":0},{"$f":"Q5*(1+Parameters!P4)","v":0},{"$f":"R5*(1+Parameters!Q4)","v":0},{"$f":"S5*(1+Parameters!R4)","v":0},{"$f":"T5*(1+Parameters!S4)","v":0},{"$f":"U5*(1+Parameters!T4)","v":0},{"$f":"V5*(1+Parameters!U4)","v":0},{"$f":"W5*(1+Parameters!V4)","v":0},{"$f":"X5*(1+Parameters!W4)","v":0},{"$f":"Y5*(1+Parameters!X4)","v":0},{"$f":"Z5*(1+Parameters!Y4)","v":0},{"$f":"AA5*(1+Parameters!Z4)","v":0},{"$f":"AB5*(1+Parameters!AA4)","v":0},{"$f":"AC5*(1+Parameters!AB4)","v":0},{"$f":"AD5*(1+Parameters!AC4)","v":0},{"$f":"AE5*(1+Parameters!AD4)","v":0},{"$f":"AF5*(1+Parameters!AE4)","v":0},{"$f":"AG5*(1+Parameters!AF4)","v":0}]
["Opbrengsten uit servicekosten",null,null,null,{"$f":"(1-Cockpit!B23)*((Cockpit!B10*Cockpit!B21*12)*(1+Parameters!C4)+(Cockpit!C10*Cockpit!C21*12)*(1+Parameters!C4))","v":0},{"$f":"E6*(1+Parameters!E3)","v":0},{"$f":"F6*(1+Parameters!F3)","v":0},{"$f":"G6*(1+Parameters!G3)","v":0},{"$f":"H6*(1+Parameters!H3)","v":0},{"$f":"I6*(1+Parameters!I3)","v":0},{"$f":"J6*(1+Parameters!J3)","v":0},{"$f":"K6*(1+Parameters!K3)","v":0},{"$f":"L6*(1+Parameters!L3)","v":0},{"$f":"M6*(1+Parameters!M3)","v":0},{"$f":"N6*(1+Parameters!N3)","v":0},{"$f":"O6*(1+Parameters!O3)","v":0},{"$f":"P6*(1+Parameters!P3)","v":0},{"$f":"Q6*(1+Parameters!Q3)","v":0},{"$f":"R6*(1+Parameters!R3)","v":0},{"$f":"S6*(1+Parameters!S3)","v":0},{"$f":"T6*(1+Parameters!T3)","v":0},{"$f":"U6*(1+Parameters!U3)","v":0},{"$f":"V6*(1+Parameters!V3)","v":0},{"$f":"W6*(1+Parameters!W3)","v":0},{"$f":"X6*(1+Parameters!X3)","v":0},{"$f":"Y6*(1+Parameters!Y3)","v":0},{"$f":"Z6*(1+Parameters!Z3)","v":0},{"$f":"AA6*(1+Parameters!AA3)","v":0},{"$f":"AB6*(1+Parameters!AB3)","v":0},{"$f":"AC6*(1+Parameters!AC3)","v":0},{"$f":"AD6*(1+Parameters!AD3)","v":0},{"$f":"AE6*(1+Parameters!AE3)","v":0},{"$f":"AF6*(1+Parameters!AF3)","v":0},{"$f":"AG6*(1+Parameters!AG3)","v":0}]
["Totaal opbrengsten",null,null,null,{"$f":"SUM(E5:E6)","v":0},{"$f":"SUM(F5:F6)","v":0},0,0,0,0,0,0,0,0,0,0,0,0,0,0,0,0,0,0,0,0,0,0,0,0,0,0,0,0]
[]
["Lasten"]
["Onderhoudslasten",null,null,null,{"$f":"IF(SUM('MJOP (2020-2049)'!E30:AH30)=0,(Cockpit!B12)*Cockpit!B26*(1+Parameters!D6)+(Cockpit!C12)*Cockpit!C26*(1+Parameters!D6),'MJOP (2020-2049)'!E30*(1+Parameters!D6))","v":0},{"$f":"IF(SUM('MJOP (2020-2049)'!E30:AH30)=0,E10*(1+Parameters!E6),'MJOP (2020-2049)'!F30*(1+Parameters!E6))","v":0},{"$f":"IF(SUM('MJOP (2020-2049)'!F30:AI30)=0,F10*(1+Parameters!F6),'MJOP (2020-2049)'!G30*(1+Parameters!F6))","v":0},{"$f":"IF(SUM('MJOP (2020-2049)'!G30:AJ30)=0,G10*(1+Parameters!G6),'MJOP (2020-2049)'!H30*(1+Parameters!G6))","v":0},{"$f":"IF(SUM('MJOP (2020-2049)'!H30:AK30)=0,H10*(1+Parameters!H6),'MJOP (2020-2049)'!I30*(1+Parameters!H6))","v":0},{"$f":"IF(SUM('MJOP (2020-2049)'!I30:AL30)=0,I10*(1+Parameters!I6),'MJOP (2020-2049)'!J30*(1+Parameters!I6))","v":0},{"$f":"IF(SUM('MJOP (2020-2049)'!J30:AM30)=0,J10*(1+Parameters!J6),'MJOP (2020-2049)'!K30*(1+Parameters!J6))","v":0},{"$f":"IF(SUM('MJOP (2020-2049)'!K30:AN30)=0,K10*(1+Parameters!K6),'MJOP (2020-2049)'!L30*(1+Parameters!K6))","v":0},{"$f":"IF(SUM('MJOP (2020-2049)'!L30:AO30)=0,L10*(1+Parameters!L6),'MJOP (2020-2049)'!M30*(1+Parameters!L6))","v":0},{"$f":"IF(SUM('MJOP (2020-2049)'!M30:AP30)=0,M10*(1+Parameters!M6),'MJOP (2020-2049)'!N30*(1+Parameters!M6))","v":0},{"$f":"IF(SUM('MJOP (2020-2049)'!N30:AQ30)=0,N10*(1+Parameters!N6),'MJOP (2020-2049)'!O30*(1+Parameters!N6))","v":0},{"$f":"IF(SUM('MJOP (2020-2049)'!O30:AR30)=0,O10*(1+Parameters!O6),'MJOP (2020-2049)'!P30*(1+Parameters!O6))","v":0},{"$f":"IF(SUM('MJOP (2020-2049)'!P30:AS30)=0,P10*(1+Parameters!P6),'MJOP (2020-2049)'!Q30*(1+Parameters!P6))","v":0},{"$f":"IF(SUM('MJOP (2020-2049)'!Q30:AT30)=0,Q10*(1+Parameters!Q6),'MJOP (2020-2049)'!R30*(1+Parameters!Q6))","v":0},{"$f":"IF(SUM('MJOP (2020-2049)'!R30:AU30)=0,R10*(1+Parameters!R6),'MJOP (2020-2049)'!S30*(1+Parameters!R6))","v":0},{"$f":"IF(SUM('MJOP (2020-2049)'!S30:AV30)=0,S10*(1+Parameters!S6),'MJOP (2020-2049)'!T30*(1+Parameters!S6))","v":0},{"$f":"IF(SUM('MJOP (2020-2049)'!T30:AW30)=0,T10*(1+Parameters!T6),'MJOP (2020-2049)'!U30*(1+Parameters!T6))","v":0},{"$f":"IF(SUM('MJOP (2020-2049)'!U30:AX30)=0,U10*(1+Parameters!U6),'MJOP (2020-2049)'!V30*(1+Parameters!U6))","v":0},{"$f":"IF(SUM('MJOP (2020-2049)'!V30:AY30)=0,V10*(1+Parameters!V6),'MJOP (2020-2049)'!W30*(1+Parameters!V6))","v":0},{"$f":"IF(SUM('MJOP (2020-2049)'!W30:AZ30)=0,W10*(1+Parameters!W6),'MJOP (2020-2049)'!X30*(1+Parameters!W6))","v":0},{"$f":"IF(SUM('MJOP (2020-2049)'!X30:BA30)=0,X10*(1+Parameters!X6),'MJOP (2020-2049)'!Y30*(1+Parameters!X6))","v":0},{"$f":"IF(SUM('MJOP (2020-2049)'!Y30:BB30)=0,Y10*(1+Parameters!Y6),'MJOP (2020-2049)'!Z30*(1+Parameters!Y6))","v":0},{"$f":"IF(SUM('MJOP (2020-2049)'!Z30:BC30)=0,Z10*(1+Parameters!Z6),'MJOP (2020-2049)'!AA30*(1+Parameters!Z6))","v":0},{"$f":"IF(SUM('MJOP (2020-2049)'!AA30:BD30)=0,AA10*(1+Parameters!AA6),'MJOP (2020-2049)'!AB30*(1+Parameters!AA6))","v":0},{"$f":"IF(SUM('MJOP (2020-2049)'!AB30:BE30)=0,AB10*(1+Parameters!AB6),'MJOP (2020-2049)'!AC30*(1+Parameters!AB6))","v":0},{"$f":"IF(SUM('MJOP (2020-2049)'!AC30:BF30)=0,AC10*(1+Parameters!AC6),'MJOP (2020-2049)'!AD30*(1+Parameters!AC6))","v":0},{"$f":"IF(SUM('MJOP (2020-2049)'!AD30:BG30)=0,AD10*(1+Parameters!AD6),'MJOP (2020-2049)'!AE30*(1+Parameters!AD6))","v":0},{"$f":"IF(SUM('MJOP (2020-2049)'!AE30:BH30)=0,AE10*(1+Parameters!AE6),'MJOP (2020-2049)'!AF30*(1+Parameters!AE6))","v":0},{"$f":"IF(SUM('MJOP (2020-2049)'!AF30:BI30)=0,AF10*(1+Parameters!AF6),'MJOP (2020-2049)'!AG30*(1+Parameters!AF6))","v":0},{"$f":"IF(SUM('MJOP (2020-2049)'!AG30:BJ30)=0,AG10*(1+Parameters!AG6),'MJOP (2020-2049)'!AH30*(1+Parameters!AG6))","v":0}]
{"$rows_left_out":35}
{"sheet":"Parameters","index":4,"n_rows":13,"n_cols":34,"rows_kept":13,"cut":false,"hidden":false,"merged":[]}
["Hulpblad - Parameters"]
["Reeksen (2019)",null,2019,2020,2021,2022,2023,2024,2025,2026,2027,2028,2029,2030,2031,2032,2033,2034,2035,2036,2037,2038,2039,2040,2041,2042,2043,2044,2045,2046,2047,2048,2049,2050]
["Prijsinflatie",null,2.5999999999999999E-2,1.0999999999999999E-2,1.2999999999999999E-2,0.01,0.01,1.4999999999999999E-2,0.02,0.02,0.02,0.02,0.02,0.02,0.02,0.02,0.02,0.02,0.02,0.02,0.02,0.02,0.02,0.02,0.02,0.02,0.02,0.02,0.02,0.02,0.02,0.02,0.02,0.02]
["Huurverhoging incl. inflatie",null,{"$f":"C3+Cockpit!$B$22","v":2.5999999999999999E-2},{"$f":"D3+Cockpit!$B$22","v":1.0999999999999999E-2},{"$f":"E3+Cockpit!$B$22","v":1.2999999999999999E-2},{"$f":"F3+Cockpit!$B$22","v":0.01},{"$f":"G3+Cockpit!$B$22","v":0.01},{"$f":"H3+Cockpit!$B$22","v":1.4999999999999999E-2},{"$f":"I3+Cockpit!$B$22","v":0.02},{"$f":"J3+Cockpit!$B$22","v":0.02},{"$f":"K3+Cockpit!$B$22","v":0.02},{"$f":"L3+Cockpit!$B$22","v":0.02},{"$f":"M3+Cockpit!$B$22","v":0.02},{"$f":"N3+Cockpit!$B$22","v":0.02},{"$f":"O3+Cockpit!$B$22","v":0.02},{"$f":"P3+Cockpit!$B$22","v":0.02},{"$f":"Q3+Cockpit!$B$22","v":0.02},{"$f":"R3+Cockpit!$B$22","v":0.02},{"$f":"S3+Cockpit!$B$22","v":0.02},{"$f":"T3+Cockpit!$B$22","v":0.02},{"$f":"U3+Cockpit!$B$22","v":0.02},{"$f":"V3+Cockpit!$B$22","v":0.02},{"$f":"W3+Cockpit!$B$22","v":0.02},{"$f":"X3+Cockpit!$B$22","v":0.02},{"$f":"Y3+Cockpit!$B$22","v":0.02},{"$f":"Z3+Cockpit!$B$22","v":0.02},{"$f":"AA3+Cockpit!$B$22","v":0.02},{"$f":"AB3+Cockpit!$B$22","v":0.02},{"$f":"AC3+Cockpit!$B$22","v":0.02},{"$f":"AD3+Cockpit!$B$22","v":0.02},{"$f":"AE3+Cockpit!$B$22","v":0.02},{"$f":"AF3+Cockpit!$B$22","v":0.02},{"$f":"AG3+Cockpit!$B$22","v":0.02},{"$f":"AH3+Cockpit!$B$22","v":0.02}]
["Loonstijging",null,2.5000000000000001E-2,2.3E-2,1.4E-2,1.9E-2,1.9E-2,1.9E-2,2.5000000000000001E-2,2.5000000000000001E-2,2.5000000000000001E-2,2.5000000000000001E-2,2.5000000000000001E-2,2.5000000000000001E-2,2.5000000000000001E-2,2.5000000000000001E-2,2.5000000000000001E-2,2.5000000000000001E-2,2.5000000000000001E-2,2.5000000000000001E-2,2.5000000000000001E-2,2.5000000000000001E-2,2.5000000000000001E-2,2.5000000000000001E-2,2.5000000000000001E-2,2.5000000000000001E-2,2.5000000000000001E-2,2.5000000000000001E-2,2.5000000000000001E-2,2.5000000000000001E-2,2.5000000000000001E-2,2.5000000000000001E-2,2.5000000000000001E-2,2.5000000000000001E-2]
["Onderhoudsindex",null,3.5000000000000003E-2,0.03,0.03,2.5000000000000001E-2,0.02,0.02,2.5000000000000001E-2,2.5000000000000001E-2,2.5000000000000001E-2,2.5000000000000001E-2,2.5000000000000001E-2,2.5000000000000001E-2,2.5000000000000001E-2,2.5000000000000001E-2,2.5000000000000001E-2,2.5000000000000001E-2,2.5000000000000001E-2,2.5000000000000001E-2,2.5000000000000001E-2,2.5000000000000001E-2,2.5000000000000001E-2,2.5000000000000001E-2,2.5000000000000001E-2,2.5000000000000001E-2,2.5000000000000001E-2,2.5000000000000001E-2,2.5000000000000001E-2,2.5000000000000001E-2,2.5000000000000001E-2,2.5000000000000001E-2,2.5000000000000001E-2,2.5000000000000001E-2]
["Marktindex (o.b.v. DNB)",null,7.2000000000000008E-2,4.5999999999999999E-2,0.02,0.02,0.02,0.02,0.02,0.02,0.02,0.02,0.02,0.02,0.02,0.02,0.02,0.02,0.02,0.02,0.02,0.02,0.02,0.02,0.02,0.02,0.02,0.02,0.02,0.02,0.02,0.02,0.02,0.02]
["Verhuurderheffing",null,5.6100000000000004E-3,5.62E-3,5.62E-3,5.6299999999999996E-3,5.3699999999999998E-3,5.3699999999999998E-3,5.3699999999999998E-3,5.3699999999999998E-3,5.3699999999999998E-3,5.3699999999999998E-3,5.3699999999999998E-3,5.3699999999999998E-3,5.3699999999999998E-3,5.3699999999999998E-3,5.3699999999999998E-3,5.3699999999999998E-3,5.3699999999999998E-3,5.3699999999999998E-3,5.3699999999999998E-3,5.3699999999999998E-3,5.3699999999999998E-3,5.3699999999999998E-3,5.3699999999999998E-3,5.3699999999999998E-3,5.3699999999999998E-3,5.3699999999999998E-3,5.3699999999999998E-3,5.3699999999999998E-3,5.3699999999999998E-3,5.3699999999999998E-3,5.3699999999999998E-3,5.3699999999999998E-3]
["Reeksen - cumulatief",null,2019,2020,2021,2022,2023,2024,2025,2026,2027,2028,2029,2030,2031,2032,2033,2034,2035,2036,2037,2038,2039,2040,2041,2042,2043,2044,2045,2046,2047,2048,2049,2050]
["Prijsinflatie - cumulatief",null,null,1,{"$f":"D10*(1+E3)","v":1.0129999999999999},1.0231299999999999,1.0333612999999999,1.0488617194999998,1.0698389538899999,1.0912357329678,1.1130604476271559,1.1353216565796991,1.1580280897112931,1.181188651505519,1.2048124245356293,1.2289086730263419,1.2534868464868687,1.2785565834166062,1.3041277150849384,1.3302102693866371,1.3568144747743698,1.3839507642698572,1.4116297795552544,1.4398623751463595,1.4686596226492867,1.4980328151022726,1.5279934714043182,1.5585533408324046,1.5897244076490527,1.6215188958020337,1.6539492737180743,1.6870282591924359,1.7207688243762846,1.7551842008638103]
{"$rows_left_out":3}